Poseidon-n
type: LexicalEntry
canonical form: Poseidon
sense: 09592056-n
part of speech: noun

09592056-n
type: LexicalConcept
in scheme: en-word.net
definition: (Greek mythology) the god of the sea and earthquakes in ancient mythology; brother of Zeus and Hades and Hera; identified with Roman Neptune
ili: i86950
lexfile: noun.person
part of speech: noun
domain topic: 07995848-n
instance hypernym: 09574485-n