Ishtar-n
type: LexicalEntry
canonical form: Ishtar
sense: 09539633-n
part of speech: noun

Mylitta-n
type: LexicalEntry
canonical form: Mylitta
sense: 09539633-n
part of speech: noun

09539633-n
type: LexicalConcept
in scheme: en-word.net
definition: Babylonian and Assyrian goddess of love and fertility and war; counterpart to the Phoenician Astarte
ili: i86633
lexfile: noun.person
part of speech: noun
domain region: 08936605-n
domain region: 08938717-n
instance hypernym: 09537037-n