Niobe-n
type: LexicalEntry
canonical form: Niobe
sense: 09520049-n
part of speech: noun

09520049-n
type: LexicalConcept
in scheme: en-word.net
definition: (Greek mythology) the daughter of Tantalus whose boasting about her children provoked Apollo and Artemis to slay them all; Niobe was turned to stone while bewailing her loss
ili: i86527
lexfile: noun.person
part of speech: noun
domain topic: 07995848-n
instance hypernym: 09507794-n