web-n
type: LexicalEntry
canonical form: web
sense: 09500167-n
part of speech: noun

09500167-n
type: LexicalConcept
in scheme: en-word.net
definition: an intricate network suggesting something that was formed by weaving or interweaving
example: the trees cast a delicate web of shadows over the lawn
ili: i86423
lexfile: noun.object
part of speech: noun
hypernym: 00002684-n