Tigris-n
type: LexicalEntry
canonical form: Tigris
sense: 09481921-n
part of speech: noun

Tigris River-n
type: LexicalEntry
canonical form: Tigris River
sense: 09481921-n
part of speech: noun

09481921-n
type: LexicalConcept
in scheme: en-word.net
definition: an Asian river; a tributary of the Euphrates River
ili: i86322
lexfile: noun.object
part of speech: noun
instance hypernym: 09434308-n