terrace-n
type: LexicalEntry
canonical form: terrace
sense: 09479337-n
part of speech: noun

bench-n
type: LexicalEntry
canonical form: bench
sense: 09479337-n
part of speech: noun

09479337-n
type: LexicalConcept
in scheme: en-word.net
definition: a level shelf of land interrupting a declivity (with steep slopes above and below)
ili: i86306
lexfile: noun.object
part of speech: noun
hypernym: 09476138-n