swath-n
type: LexicalEntry
canonical form: swath
sense: 09475783-n
part of speech: noun

belt-n
type: LexicalEntry
canonical form: belt
sense: 09475783-n
part of speech: noun

09475783-n
type: LexicalConcept
in scheme: en-word.net
definition: a path or strip (as cut by one course of mowing)
ili: i86285
lexfile: noun.object
part of speech: noun
hypernym: 09410115-n