Skagerrak-n
type: LexicalEntry
canonical form: Skagerrak
sense: 09459203-n
part of speech: noun

Skagerak-n
type: LexicalEntry
canonical form: Skagerak
sense: 09459203-n
part of speech: noun

09459203-n
type: LexicalConcept
in scheme: en-word.net
definition: a broad strait of the North Sea between Jutland and Norway
ili: i86195
lexfile: noun.object
part of speech: noun
instance hypernym: 09469019-n