roof-n
type: LexicalEntry
canonical form: roof
sense: 09439768-n
part of speech: noun

09439768-n
type: LexicalConcept
in scheme: en-word.net
definition: the inner top surface of a covered area or hollow space
example: the roof of the cave was very high
example: I could see the roof of the bear's mouth
ili: i86085
lexfile: noun.object
part of speech: noun
hypernym: 09280855-n