plate-n
type: LexicalEntry
canonical form: plate
sense: 09418350-n
part of speech: noun

crustal plate-n
type: LexicalEntry
canonical form: crustal plate
sense: 09418350-n
part of speech: noun

09418350-n
type: LexicalConcept
in scheme: en-word.net
definition: a rigid layer of the Earth's crust that is believed to drift slowly
ili: i85991
lexfile: noun.object
part of speech: noun
hypernym: 09282916-n