Pisces-n
type: LexicalEntry
canonical form: Pisces
sense: 09415717-n
part of speech: noun

09415717-n
type: LexicalConcept
in scheme: en-word.net
definition: a large faint zodiacal constellation; between Aquarius and Aries
ili: i85980
lexfile: noun.object
part of speech: noun
instance hypernym: 09275876-n