nucleus-n
type: LexicalEntry
canonical form: nucleus
sense: 09397997-n
part of speech: noun

09397997-n
type: LexicalConcept
in scheme: en-word.net
definition: the positively charged dense center of an atom
ili: i85890
lexfile: noun.object
part of speech: noun
hypernym: 08538999-n
mero part: 09397798-n