mechanism-n
type: LexicalEntry
canonical form: mechanism
sense: 09372694-n
part of speech: noun

09372694-n
type: LexicalConcept
in scheme: en-word.net
definition: a natural object resembling a machine in structure or function
example: the mechanism of the ear
example: the mechanism of infection
ili: i85762
lexfile: noun.object
part of speech: noun
hypernym: 00019308-n