lake-n
type: LexicalEntry
canonical form: lake
sense: 09351810-n
part of speech: noun

09351810-n
type: LexicalConcept
in scheme: en-word.net
definition: a body of (usually fresh) water surrounded by land
ili: i85647
lexfile: noun.object
part of speech: noun
hypernym: 09248053-n
mero part: 09304990-n
mero part: 09336622-n