island-n
type: LexicalEntry
canonical form: island
sense: 09339360-n
part of speech: noun

09339360-n
type: LexicalConcept
in scheme: en-word.net
definition: a land mass (smaller than a continent) that is surrounded by water
ili: i85597
lexfile: noun.object
part of speech: noun
hypernym: 09357302-n