hill-n
type: LexicalEntry
canonical form: hill
sense: 09325914-n
part of speech: noun

09325914-n
type: LexicalConcept
in scheme: en-word.net
definition: a local and well-defined elevation of the land
example: they loved to roam the hills of West Virginia
ili: i85525
lexfile: noun.object
part of speech: noun
hypernym: 09389214-n
mero part: 09326434-n