expanse-n
type: LexicalEntry
canonical form: expanse
sense: 09300444-n
part of speech: noun

09300444-n
type: LexicalConcept
in scheme: en-word.net
definition: a wide and open space or area as of surface or land or sky
ili: i85379
lexfile: noun.object
part of speech: noun
hypernym: 13933399-n