couple-n
type: LexicalEntry
canonical form: couple
sense: 09280469-n
part of speech: noun

09280469-n
type: LexicalConcept
in scheme: en-word.net
definition: (physics) something joined by two equal and opposite forces that act along parallel lines
ili: i85271
lexfile: noun.object
part of speech: noun
domain topic: 06100457-n
hypernym: 09488589-n
mero part: 11503579-n