core-n
type: LexicalEntry
canonical form: core
sense: 09279801-n
part of speech: noun

09279801-n
type: LexicalConcept
in scheme: en-word.net
definition: a cylindrical sample of soil or rock obtained with a hollow drill
ili: i85266
lexfile: noun.object
part of speech: noun
hypernym: 09444303-n