channel-n
type: LexicalEntry
canonical form: channel
sense: 09264153-n
part of speech: noun

09264153-n
type: LexicalConcept
in scheme: en-word.net
definition: a deep and relatively narrow body of water (as in a river or a harbor or a strait linking two larger bodies) that allows the best passage for vessels
example: the ship went aground in the channel
ili: i85192
lexfile: noun.object
part of speech: noun
domain topic: 09434308-n
hypernym: 09248053-n