chain-n
type: LexicalEntry
canonical form: chain
sense: 09263527-n
part of speech: noun

chemical chain-n
type: LexicalEntry
canonical form: chemical chain
sense: 09263527-n
part of speech: noun

09263527-n
type: LexicalConcept
in scheme: en-word.net
definition: (chemistry) a series of linked atoms (generally in an organic molecule)
ili: i85189
lexfile: noun.object
part of speech: noun
domain topic: 06094057-n
hypernym: 09488589-n