bedrock-n
type: LexicalEntry
canonical form: bedrock
sense: 09240951-n
part of speech: noun

09240951-n
type: LexicalConcept
in scheme: en-word.net
definition: solid unweathered rock lying beneath surface deposits of soil
ili: i85063
lexfile: noun.object
part of speech: noun
hypernym: 09438954-n