bed-n
type: LexicalEntry
canonical form: bed
sense: 09240774-n
part of speech: noun

09240774-n
type: LexicalConcept
in scheme: en-word.net
definition: (geology) a stratum of rock (especially sedimentary rock)
example: they found a bed of sandstone
ili: i85062
lexfile: noun.object
part of speech: noun
domain topic: 06125308-n
hypernym: 08674880-n