bed-n
type: LexicalEntry
canonical form: bed
sense: 09240545-n
part of speech: noun

bottom-n
type: LexicalEntry
canonical form: bottom
sense: 09240545-n
part of speech: noun

09240545-n
type: LexicalConcept
in scheme: en-word.net
definition: a depression forming the ground under a body of water
example: he searched for treasure on the ocean bed
ili: i85061
lexfile: noun.object
part of speech: noun
hypernym: 09388914-n