basin-n
type: LexicalEntry
canonical form: basin
sense: 09238344-n
part of speech: noun

09238344-n
type: LexicalConcept
in scheme: en-word.net
definition: a natural depression in the surface of the land often with a lake at the bottom of it
example: the basin of the Great Salt Lake
ili: i85051
lexfile: noun.object
part of speech: noun
hypernym: 09388914-n