agent-n
type: LexicalEntry
canonical form: agent
sense: 09213796-n
part of speech: noun

09213796-n
type: LexicalConcept
in scheme: en-word.net
definition: an active and efficient cause; capable of producing a certain effect
example: their research uncovered new disease agents
ili: i84938
lexfile: noun.object
part of speech: noun
hypernym: 00007347-n