compulsion-n
type: LexicalEntry
canonical form: compulsion
sense: 09206152-n
part of speech: noun

obsession-n
type: LexicalEntry
canonical form: obsession
sense: 09206152-n
part of speech: noun

09206152-n
type: LexicalConcept
in scheme: en-word.net
definition: an irrational motive for performing trivial or repetitive actions, even against your will
example: her compulsion to wash her hands repeatedly
ili: i84904
lexfile: noun.motive
part of speech: noun
hypernym: 09203156-n