Sub-Saharan Africa-n
type: LexicalEntry
canonical form: Sub-Saharan Africa
sense: 09195377-n
part of speech: noun

Black Africa-n
type: LexicalEntry
canonical form: Black Africa
sense: 09195377-n
part of speech: noun

09195377-n
type: LexicalConcept
in scheme: en-word.net
definition: the region of Africa to the south of the Sahara Desert
ili: i84838
lexfile: noun.location
part of speech: noun
instance hypernym: 08591861-n