Green Bay-n
type: LexicalEntry
canonical form: Green Bay
sense: 09180552-n
part of speech: noun

09180552-n
type: LexicalConcept
in scheme: en-word.net
definition: a city of eastern Wisconsin on an arm of Lake Michigan
ili: i84760
lexfile: noun.location
part of speech: noun
instance hypernym: 08542298-n