Lubbock-n
type: LexicalEntry
canonical form: Lubbock
sense: 09167954-n
part of speech: noun

09167954-n
type: LexicalConcept
in scheme: en-word.net
definition: a city in northwest Texas to the south of Amarillo
ili: i84693
lexfile: noun.location
part of speech: noun
instance hypernym: 08542298-n