Dallas-n
type: LexicalEntry
canonical form: Dallas
sense: 09166523-n
part of speech: noun

09166523-n
type: LexicalConcept
in scheme: en-word.net
definition: a large commercial and industrial city in northeastern Texas located in the heart of the northern Texas oil fields
ili: i84684
lexfile: noun.location
part of speech: noun
instance hypernym: 08542298-n