Wilmington-n
type: LexicalEntry
canonical form: Wilmington
sense: 09151860-n
part of speech: noun

09151860-n
type: LexicalConcept
in scheme: en-word.net
definition: a town in southeastern North Carolina on the Cape Fear River
ili: i84608
lexfile: noun.location
part of speech: noun
instance hypernym: 08683242-n