Abilene-n
type: LexicalEntry
canonical form: Abilene
sense: 09110709-n
part of speech: noun

09110709-n
type: LexicalConcept
in scheme: en-word.net
definition: a town in central Kansas to the west of Topeka; home of Dwight D. Eisenhower
ili: i84385
lexfile: noun.location
part of speech: noun
instance hypernym: 08683242-n