United Arab Emirates-n
type: LexicalEntry
canonical form: United Arab Emirates
sense: 09066665-n
part of speech: noun

09066665-n
type: LexicalConcept
in scheme: en-word.net
definition: a federation of seven Arab emirates on the eastern Arabian peninsula; achieved independence from the United Kingdom in 1971; rich in oil reserves
ili: i84179
lexfile: noun.location
part of speech: noun
instance hypernym: 08718069-n
mero part: 09067011-n
mero part: 09067189-n