Sardis-n
type: LexicalEntry
canonical form: Sardis
sense: 09065150-n
part of speech: noun

09065150-n
type: LexicalConcept
in scheme: en-word.net
definition: an ancient Greek city located in the western part of what is now modern Turkey; as the capital of Lydia it was the cultural center of Asia Minor; destroyed by Tamerlane in 1402
ili: i84171
lexfile: noun.location
part of speech: noun
instance hypernym: 08542298-n