Georgia-n
type: LexicalEntry
canonical form: Georgia
sense: 09041218-n
part of speech: noun

Sakartvelo-n
type: LexicalEntry
canonical form: Sakartvelo
sense: 09041218-n
part of speech: noun

09041218-n
type: LexicalConcept
in scheme: en-word.net
definition: a republic in Asia Minor on the Black Sea separated from Russia by the Caucasus mountains; formerly an Asian soviet but became independent in 1991
ili: i84062
lexfile: noun.location
part of speech: noun
instance hypernym: 08718069-n
mero member: 09748498-n
mero part: 09041564-n
mero part: 09041725-n
mero part: 09041962-n