Murmansk-n
type: LexicalEntry
canonical form: Murmansk
sense: 09031093-n
part of speech: noun

09031093-n
type: LexicalConcept
in scheme: en-word.net
definition: a port city in northwestern Russia on the Kola Peninsula; the largest city to the north of the Arctic Circle; an important supply line to Russia in World War I and World War II
ili: i84009
lexfile: noun.location
part of speech: noun
instance hypernym: 08542298-n
instance hypernym: 08651532-n