Rabat-n
type: LexicalEntry
canonical form: Rabat
sense: 08992796-n
part of speech: noun

capital of Morocco-n
type: LexicalEntry
canonical form: capital of Morocco
sense: 08992796-n
part of speech: noun

08992796-n
type: LexicalConcept
in scheme: en-word.net
definition: the capital of Morocco; located in the northwestern on the Atlantic coast
ili: i83837
lexfile: noun.location
part of speech: noun
instance hypernym: 08709407-n