Nantes-n
type: LexicalEntry
canonical form: Nantes
sense: 08956882-n
part of speech: noun

08956882-n
type: LexicalConcept
in scheme: en-word.net
definition: a port city in western France on the Loire estuary
ili: i83670
lexfile: noun.location
part of speech: noun
instance hypernym: 08542298-n
instance hypernym: 08651532-n