Tasmania-n
type: LexicalEntry
canonical form: Tasmania
sense: 08852973-n
part of speech: noun

08852973-n
type: LexicalConcept
in scheme: en-word.net
definition: an island off the southeastern coast of Australia
ili: i83254
lexfile: noun.location
part of speech: noun
instance hypernym: 09339360-n