Quebec-n
type: LexicalEntry
canonical form: Quebec
sense: 08848063-n
part of speech: noun

08848063-n
type: LexicalConcept
in scheme: en-word.net
definition: the largest province of Canada; a French colony from 1663 to 1759 when it was lost to the British
ili: i83234
lexfile: noun.location
part of speech: noun
instance hypernym: 08840877-n
mero part: 08848309-n
mero part: 08848525-n
mero part: 09344244-n
mero part: 09353510-n