Trento-n
type: LexicalEntry
canonical form: Trento
sense: 08830404-n
part of speech: noun

Trent-n
type: LexicalEntry
canonical form: Trent
sense: 08830404-n
part of speech: noun

08830404-n
type: LexicalConcept
in scheme: en-word.net
definition: a city in northern Italy (northwest of Venice) on the River Adige; the site of the Council of Trent
ili: i83157
lexfile: noun.location
part of speech: noun
instance hypernym: 08542298-n