Philistia-n
type: LexicalEntry
canonical form: Philistia
sense: 08817558-n
part of speech: noun

08817558-n
type: LexicalConcept
in scheme: en-word.net
definition: an ancient region on the coast of southwestern Palestine that was strategically located on a trade route between Syria and Egypt; important in biblical times
ili: i83099
lexfile: noun.location
part of speech: noun
instance hypernym: 08591861-n