Wiesbaden-n
type: LexicalEntry
canonical form: Wiesbaden
sense: 08792886-n
part of speech: noun

08792886-n
type: LexicalConcept
in scheme: en-word.net
definition: a city in western Germany; a spa since Roman times
ili: i82989
lexfile: noun.location
part of speech: noun
instance hypernym: 08542298-n
instance hypernym: 08696353-n