Cologne-n
type: LexicalEntry
canonical form: Cologne
sense: 08790140-n
part of speech: noun

Koln-n
type: LexicalEntry
canonical form: Koln
sense: 08790140-n
part of speech: noun

08790140-n
type: LexicalConcept
in scheme: en-word.net
definition: a commercial center and river port in western Germany on the Rhine River; flourished during the 15th century as a member of the Hanseatic League
ili: i82974
lexfile: noun.location
part of speech: noun
instance hypernym: 08542298-n