British Virgin Islands-n
type: LexicalEntry
canonical form: British Virgin Islands
sense: 08772647-n
part of speech: noun

08772647-n
type: LexicalConcept
in scheme: en-word.net
definition: more than 40 northeastern Virgin Islands (15 inhabited); a dependent territory of the United Kingdom
ili: i82893
lexfile: noun.location
part of speech: noun
instance hypernym: 08649106-n