Virgin Islands-n
type: LexicalEntry
canonical form: Virgin Islands
sense: 08772362-n
part of speech: noun

08772362-n
type: LexicalConcept
in scheme: en-word.net
definition: a group of islands in northeastern West Indies (east of Puerto Rico) discovered by Christopher Columbus in 1493; owned by United States and Britain
ili: i82892
lexfile: noun.location
part of speech: noun
instance hypernym: 09339360-n
mero part: 08627044-n
mero part: 08772647-n
mero part: 08772836-n