Panama-n
type: LexicalEntry
canonical form: Panama
sense: 08757039-n
part of speech: noun

Republic of Panama-n
type: LexicalEntry
canonical form: Republic of Panama
sense: 08757039-n
part of speech: noun

08757039-n
type: LexicalConcept
in scheme: en-word.net
definition: a republic on the Isthmus of Panama; achieved independence from Colombia in 1903
ili: i82812
lexfile: noun.location
part of speech: noun
instance hypernym: 08720849-n
mero member: 09745534-n
mero part: 03886731-n
mero part: 08757345-n
mero part: 08757502-n
mero part: 08757662-n