Cali-n
type: LexicalEntry
canonical form: Cali
sense: 08750996-n
part of speech: noun

08750996-n
type: LexicalConcept
in scheme: en-word.net
definition: city in southwestern Colombia in a rich agricultural area
ili: i82781
lexfile: noun.location
part of speech: noun
instance hypernym: 08542298-n