Bogota-n
type: LexicalEntry
canonical form: Bogota
sense: 08750812-n
part of speech: noun

capital of Colombia-n
type: LexicalEntry
canonical form: capital of Colombia
sense: 08750812-n
part of speech: noun

08750812-n
type: LexicalConcept
in scheme: en-word.net
definition: capital and largest city of Colombia; located in central Colombia on a high fertile plain
ili: i82780
lexfile: noun.location
part of speech: noun
instance hypernym: 08709407-n